{"text_format":"3","workbook":"xlsx","n_sheets":7,"sheets":["Anforderungsliste EN","Dropdown Quelle","Anforderung Antragsteller","ALT Prüfung Priorität","ALT Prüfer-Hinweis","ALT Prüfer","ALT 1.Prüfung"],"not_rendered":{"defined_names":9},"read":"whole","date_system":"1900"}

{"sheet":"Anforderungsliste EN","index":0,"n_rows":52,"n_cols":15,"rows_kept":52,"merged":[[0,1,0,5],[2,5,2,6],[2,8,2,10],[2,12,2,14],[3,0,3,1],[3,5,3,6],[4,5,4,6]]}
[null,"List of requirements for the EHPA-Qualtiy Label application"]
[null,"1. select application form:",null,"*Please select from list*",null,"3. fill in the fields:"]
[null,"2. select heat pump type:",null,"*Please select from list*",null,"Basic data (mandatory)",null,null,"Models (mandatory)",{"$nulls":3},"Comments (optional)"]
[{"$nulls":5},"*Company name*",null,null,"*Model 1*","*Model 2*","insert further columns for more models",null,"*Name*","*Name*","*Name*"]
[null,"Document V13.6 Basis: EHPA regulations version 2.3 dated 01.04.2026",null,"Requirement for the selected application form",null,"*model-range name*",{"$nulls":6},"*date*","*date*","*date*"]
[1,"Fundamentals",null,"-",null,"Name of document","Page",null,"ok ... submitted\nx ... not submitted / correct\n- ... not necessary"]
{"$rows_left_out":47}
{"sheet":"Dropdown Quelle","index":1,"n_rows":7,"n_cols":9,"rows_kept":7,"hidden":true}
[]
[]
[]
[]
["Select application form:","*Please select from list*","Initial application","Transfer from another country or another company","1st and 2nd renewal (valid for max. 9 years)","from 3rd renewal (validity over 9 years)","Extension of an existing quality label","Change of product names","Technical changes to the product"]
[]
{"$rows_left_out":2}
{"sheet":"Anforderung Antragsteller","index":2,"n_rows":51,"n_cols":37,"rows_kept":51,"hidden":true,"merged":[[2,2,2,6],[2,7,2,11],[2,12,2,16],[2,17,2,21],[2,22,2,26],[2,27,2,31],[2,32,2,36],[3,2,3,6],[3,7,3,11],[3,12,3,16],[3,17,3,21],[3,22,3,26],[3,27,3,31],[3,32,3,36]]}
["Liste Anforderungen an den Antragsteller je Antrag"]
[]
[null,null,{"$f":"'Dropdown Quelle'!C5","v":"Initial application"},{"$nulls":4},{"$f":"'Dropdown Quelle'!D5","v":"Transfer from another country or another company"},{"$nulls":4},{"$f":"'Dropdown Quelle'!E5","v":"1st and 2nd renewal (valid for max. 9 years)"},{"$nulls":4},{"$f":"'Dropdown Quelle'!F5","v":"from 3rd renewal (validity over 9 years)"},{"$nulls":4},{"$f":"'Dropdown Quelle'!G5","v":"Extension of an existing quality label"},{"$nulls":4},{"$f":"'Dropdown Quelle'!H5","v":"Change of product names"},{"$nulls":4},{"$f":"'Dropdown Quelle'!I5","v":"Technical changes to the product"}]
[null,null,"Erstantrag (Elterngütesiegel);  Einzelprodukt oder Baureihe",{"$nulls":4},"Übertragung auf Basis eines Elterngütesiegel (Followup-Gütesiegel);   Übertragung zwischen zwei Ländern oder Unternehmen, mit gleicher oder nicht gleicher Produktbezeichnung",{"$nulls":4},"Verlängerung von Elterngütesiegel oder Followup; 1. und 2. Verlängerung des Elterngütesiegels",{"$nulls":4},"Verlängerung von Elterngütesiegel oder Followup; jede weitere Verlängerung",{"$nulls":4},"Erweiterung von Elterngütesiegel oder Followup;  Erweiterung des Gütesiegels um ein oder mehrere Modelle",{"$nulls":4},"Änderung von Elterngütesiegel oder Followup;  Änderung der Produktbezeichnungen",{"$nulls":4},"Technische Änderungen am Produkt"]
[1,"Grundlegendes",{"$f":"$C$3&\" \"&'Dropdown Quelle'!C7","v":"Initial application Air/water"},{"$f":"$C$3&\" \"&'Dropdown Quelle'!D7","v":"Initial application Water/water"},{"$f":"$C$3&\" \"&'Dropdown Quelle'!E7","v":"Initial application Brine/water"},{"$f":"$C$3&\" \"&'Dropdown Quelle'!F7","v":"Initial application Air/air"},{"$f":"$C$3&\" \"&'Dropdown Quelle'!G7","v":"Initial application Domestic hot water heat pump"},{"$f":"$H$3&\" \"&'Dropdown Quelle'!C7","v":"Transfer from another country or another company Air/water"},{"$f":"$H$3&\" \"&'Dropdown Quelle'!D7","v":"Transfer from another country or another company Water/water"},{"$f":"$H$3&\" \"&'Dropdown Quelle'!E7","v":"Transfer from another country or another company Brine/water"},{"$f":"$H$3&\" \"&'Dropdown Quelle'!F7","v":"Transfer from another country or another company Air/air"},{"$f":"$H$3&\" \"&'Dropdown Quelle'!G7","v":"Transfer from another country or another company Domestic hot water heat pump"},{"$f":"$M$3&\" \"&'Dropdown Quelle'!C7","v":"1st and 2nd renewal (valid for max. 9 years) Air/water"},{"$f":"$M$3&\" \"&'Dropdown Quelle'!D7","v":"1st and 2nd renewal (valid for max. 9 years) Water/water"},{"$f":"$M$3&\" \"&'Dropdown Quelle'!E7","v":"1st and 2nd renewal (valid for max. 9 years) Brine/water"},{"$f":"$M$3&\" \"&'Dropdown Quelle'!F7","v":"1st and 2nd renewal (valid for max. 9 years) Air/air"},{"$f":"$M$3&\" \"&'Dropdown Quelle'!G7","v":"1st and 2nd renewal (valid for max. 9 years) Domestic hot water heat pump"},{"$f":"$R$3&\" \"&'Dropdown Quelle'!C7","v":"from 3rd renewal (validity over 9 years) Air/water"},{"$f":"$R$3&\" \"&'Dropdown Quelle'!D7","v":"from 3rd renewal (validity over 9 years) Water/water"},{"$f":"$R$3&\" \"&'Dropdown Quelle'!E7","v":"from 3rd renewal (validity over 9 years) Brine/water"},{"$f":"$R$3&\" \"&'Dropdown Quelle'!F7","v":"from 3rd renewal (validity over 9 years) Air/air"},{"$f":"$R$3&\" \"&'Dropdown Quelle'!G7","v":"from 3rd renewal (validity over 9 years) Domestic hot water heat pump"},{"$f":"$W$3&\" \"&'Dropdown Quelle'!C7","v":"Extension of an existing quality label Air/water"},{"$f":"$W$3&\" \"&'Dropdown Quelle'!D7","v":"Extension of an existing quality label Water/water"},{"$f":"$W$3&\" \"&'Dropdown Quelle'!E7","v":"Extension of an existing quality label Brine/water"},{"$f":"$W$3&\" \"&'Dropdown Quelle'!F7","v":"Extension of an existing quality label Air/air"},{"$f":"$W$3&\" \"&'Dropdown Quelle'!G7","v":"Extension of an existing quality label Domestic hot water heat pump"},{"$f":"$AB$3&\" \"&'Dropdown Quelle'!C7","v":"Change of product names Air/water"},{"$f":"$AB$3&\" \"&'Dropdown Quelle'!D7","v":"Change of product names Water/water"},{"$f":"$AB$3&\" \"&'Dropdown Quelle'!E7","v":"Change of product names Brine/water"},{"$f":"$AB$3&\" \"&'Dropdown Quelle'!F7","v":"Change of product names Air/air"},{"$f":"$AB$3&\" \"&'Dropdown Quelle'!G7","v":"Change of product names Domestic hot water heat pump"},{"$f":"$AG$3&\" \"&'Dropdown Quelle'!C7","v":"Technical changes to the product Air/water"},{"$f":"$AG$3&\" \"&'Dropdown Quelle'!D7","v":"Technical changes to the product Water/water"},{"$f":"$AG$3&\" \"&'Dropdown Quelle'!E7","v":"Technical changes to the product Brine/water"},{"$f":"$AG$3&\" \"&'Dropdown Quelle'!F7","v":"Technical changes to the product Air/air"},{"$f":"$AG$3&\" \"&'Dropdown Quelle'!G7","v":"Technical changes to the product Domestic hot water heat pump"}]
[null,"akkreditierte Prüfberichte nach EN 12102-1 und -2, EN 14511-2 bis 4 und EN 14825, bzw. EN 16147 bei Trinkwasser\nAnzahl hängt vom Umfang der Modelreihe ab","-","-","-","-","-","-","-","-","-","-","-","-","-","-","-","-","-","-","-","-","-","-","-","-","-","-","-","-","-","-","-","-","-","-","-"]
{"$rows_left_out":46}
{"sheet":"ALT Prüfung Priorität","index":3,"n_rows":49,"n_cols":9,"rows_kept":49,"hidden":true}
["2. Prüfung Priorität - verpflichtende Anforderung zum Ausstellen"]
[]
[null,null,{"$f":"'Anforderung Antragsteller'!C3","v":"Initial application"},{"$f":"'Anforderung Antragsteller'!H3","v":"Transfer from another country or another company"},{"$f":"'Anforderung Antragsteller'!M3","v":"1st and 2nd renewal (valid for max. 9 years)"},{"$f":"'Anforderung Antragsteller'!R3","v":"from 3rd renewal (validity over 9 years)"},{"$f":"'Anforderung Antragsteller'!W3","v":"Extension of an existing quality label"},{"$f":"'Anforderung Antragsteller'!AB3","v":"Change of product names"},{"$f":"'Anforderung Antragsteller'!AG3","v":"Technical changes to the product"}]
[1,"Grundlegendes"]
[null,"akkreditierte Prüfberichte nach EN 14511-1 bis 4 und EN 14825, bzw. EN 16147 und EN 12102-1 \nAnzahl hängt vom Umfang der Modelreihe ab","-","-","-","-","-","-","-"]
[null,"- Unterschriebener akkreditierter Leistungs-Prüfbericht UND","ja, egal welches Prüfschema (HP-Keymark, EHPA, …)",{"$f":"IF(OR('Anforderung Antragsteller'!H7=\"muss nicht erneut eingereicht werden\",'Anforderung Antragsteller'!H7=\"nicht erforderlich\"),\"-\",$C6)","v":"ja, egal welches Prüfschema (HP-Keymark, EHPA, …)"},{"$f":"IF(OR('Anforderung Antragsteller'!M7=\"muss nicht erneut eingereicht werden\",'Anforderung Antragsteller'!M7=\"nicht erforderlich\"),\"-\",$C6)","v":"ja, egal welches Prüfschema (HP-Keymark, EHPA, …)"},{"$f":"IF(OR('Anforderung Antragsteller'!R7=\"muss nicht erneut eingereicht werden\",'Anforderung Antragsteller'!R7=\"nicht erforderlich\"),\"-\",$C6)","v":"ja, egal welches Prüfschema (HP-Keymark, EHPA, …)"},{"$f":"IF(OR('Anforderung Antragsteller'!W7=\"muss nicht erneut eingereicht werden\",'Anforderung Antragsteller'!W7=\"nicht erforderlich\"),\"-\",$C6)","v":"ja, egal welches Prüfschema (HP-Keymark, EHPA, …)"},{"$f":"IF(OR('Anforderung Antragsteller'!AB7=\"muss nicht erneut eingereicht werden\",'Anforderung Antragsteller'!AB7=\"nicht erforderlich\"),\"-\",$C6)","v":"ja, egal welches Prüfschema (HP-Keymark, EHPA, …)"},{"$f":"IF(OR('Anforderung Antragsteller'!AG7=\"muss nicht erneut eingereicht werden\",'Anforderung Antragsteller'!AG7=\"nicht erforderlich\"),\"-\",$C6)","v":"ja, egal welches Prüfschema (HP-Keymark, EHPA, …)"}]
{"$rows_left_out":44}
{"sheet":"ALT Prüfer-Hinweis","index":4,"n_rows":50,"n_cols":9,"rows_kept":50,"hidden":true}
["2. Prüfung Prüferhinweis"]
[]
[null,null,{"$f":"'Anforderung Antragsteller'!C3","v":"Initial application"},{"$f":"'Anforderung Antragsteller'!H3","v":"Transfer from another country or another company"},{"$f":"'Anforderung Antragsteller'!M3","v":"1st and 2nd renewal (valid for max. 9 years)"},{"$f":"'Anforderung Antragsteller'!R3","v":"from 3rd renewal (validity over 9 years)"},{"$f":"'Anforderung Antragsteller'!W3","v":"Extension of an existing quality label"},{"$f":"'Anforderung Antragsteller'!AB3","v":"Change of product names"},{"$f":"'Anforderung Antragsteller'!AG3","v":"Technical changes to the product"}]
[1,"Grundlegendes"]
[null,"akkreditierte Prüfberichte nach EN 12102-1 und -2, EN 14511-2 bis 4 und EN 14825, bzw. EN 16147 bei Trinkwasser\nAnzahl hängt vom Umfang der Modelreihe ab","-","-","-","-","-","-","-"]
[null,"- Unterschriebener detaillierter akkreditierter Leistungs-Prüfbericht nach EHPA Regularien oder HP-Keymark Regularien UND","Ist die Prüfung nach EHPA Regularien oder HP-Keymark-Schema und unter der Akkreditierung des Prüfinsitutes durchgeführt worden (Logo eines nationalen oder Internationalen Akkreditierungs-Institiutes oder schriftlicher Verweis auf die Akkreditierung); ist der Prüfbericht unterschrieben oder gültig digital signiert; stimmen Leistungswerte mit den technischen Unterlagen überein (SCOP +- 0,1 lt. Freimüller); wurden die erforderliche Anzahl an Prüfberichten eingereicht; Wird das Gerät als LT und MT verkauft müssen auch im Prüfbericht SCOP Werte für beide Temperaturanwendungen enthalten sein.",{"$f":"IF(OR('Anforderung Antragsteller'!H7=\"does not need to be resubmitted\",'Anforderung Antragsteller'!H7=\"not required\"),\"-\",$C6)","v":"Ist die Prüfung nach EHPA Regularien oder HP-Keymark-Schema und unter der Akkreditierung des Prüfinsitutes durchgeführt worden (Logo eines nationalen oder Internationalen Akkreditierungs-Institiutes oder schriftlicher Verweis auf die Akkreditierung); ist der Prüfbericht unterschrieben oder gültig digital signiert; stimmen Leistungswerte mit den technischen Unterlagen überein (SCOP +- 0,1 lt. Freimüller); wurden die erforderliche Anzahl an Prüfberichten eingereicht; Wird das Gerät als LT und MT verkauft müssen auch im Prüfbericht SCOP Werte für beide Temperaturanwendungen enthalten sein."},{"$f":"IF(OR('Anforderung Antragsteller'!M7=\"does not need to be resubmitted\",'Anforderung Antragsteller'!M7=\"not required\"),\"-\",$C6)","v":"-"},{"$f":"IF(OR('Anforderung Antragsteller'!R7=\"does not need to be resubmitted\",'Anforderung Antragsteller'!R7=\"not required\"),\"-\",$C6)","v":"Ist die Prüfung nach EHPA Regularien oder HP-Keymark-Schema und unter der Akkreditierung des Prüfinsitutes durchgeführt worden (Logo eines nationalen oder Internationalen Akkreditierungs-Institiutes oder schriftlicher Verweis auf die Akkreditierung); ist der Prüfbericht unterschrieben oder gültig digital signiert; stimmen Leistungswerte mit den technischen Unterlagen überein (SCOP +- 0,1 lt. Freimüller); wurden die erforderliche Anzahl an Prüfberichten eingereicht; Wird das Gerät als LT und MT verkauft müssen auch im Prüfbericht SCOP Werte für beide Temperaturanwendungen enthalten sein."},{"$f":"IF(OR('Anforderung Antragsteller'!W7=\"does not need to be resubmitted\",'Anforderung Antragsteller'!W7=\"not required\"),\"-\",$C6)","v":"Ist die Prüfung nach EHPA Regularien oder HP-Keymark-Schema und unter der Akkreditierung des Prüfinsitutes durchgeführt worden (Logo eines nationalen oder Internationalen Akkreditierungs-Institiutes oder schriftlicher Verweis auf die Akkreditierung); ist der Prüfbericht unterschrieben oder gültig digital signiert; stimmen Leistungswerte mit den technischen Unterlagen überein (SCOP +- 0,1 lt. Freimüller); wurden die erforderliche Anzahl an Prüfberichten eingereicht; Wird das Gerät als LT und MT verkauft müssen auch im Prüfbericht SCOP Werte für beide Temperaturanwendungen enthalten sein."},{"$f":"IF(OR('Anforderung Antragsteller'!AB7=\"does not need to be resubmitted\",'Anforderung Antragsteller'!AB7=\"not required\"),\"-\",$C6)","v":"-"},"Prübreicht ist nur dann notwendig, wenn die Gütesiegel-Kommission eine Nachmessung verlangt"]
{"$rows_left_out":45}
{"sheet":"ALT Prüfer","index":5,"n_rows":51,"n_cols":7,"rows_kept":51,"hidden":true,"merged":[[3,0,3,1],[3,5,3,6],[4,5,4,6]]}
[null,"Anforderungsliste  für die EHPA-Gütesiegel-Beantragung"]
[null,"Antragsform:",null,{"$f":"Antr","v":"*Please select from list*"}]
[null,"Wärmepumpen-Typ:",null,{"$f":"'Anforderungsliste EN'!D3","v":"*Please select from list*"}]
[{"$nulls":5},{"$f":"'Anforderungsliste EN'!F4","v":"*Company name*"}]
[{"$nulls":3},"Anforderung für die gewählte Antragsform",null,{"$f":"'Anforderungsliste EN'!F5","v":"*model-range name*"}]
[1,"Grundlegendes",{"$nulls":3},"Hinweise zur Prüfung","ist verpflichtend zum Ausstellen"]
{"$rows_left_out":46}
{"sheet":"ALT 1.Prüfung","index":6,"n_rows":49,"n_cols":9,"rows_kept":49,"hidden":true}
["Liste für 1.Prüfung"]
[]
[null,null,{"$f":"'Anforderung Antragsteller'!C3","v":"Initial application"},{"$f":"'Anforderung Antragsteller'!H3","v":"Transfer from another country or another company"},{"$f":"'Anforderung Antragsteller'!M3","v":"1st and 2nd renewal (valid for max. 9 years)"},{"$f":"'Anforderung Antragsteller'!R3","v":"from 3rd renewal (validity over 9 years)"},{"$f":"'Anforderung Antragsteller'!W3","v":"Extension of an existing quality label"},{"$f":"'Anforderung Antragsteller'!AB3","v":"Change of product names"},{"$f":"'Anforderung Antragsteller'!AG3","v":"Technical changes to the product"}]
[1,"Grundlegendes"]
[null,"akkreditierte Prüfberichte nach EN 14511-1 bis 4 und EN 14825, bzw. EN 16147 und EN 12102-1 \nAnzahl hängt vom Umfang der Modelreihe ab","-",{"$f":"IF(OR('Anforderung Antragsteller'!H6=\"muss nicht erneut eingereicht werden\",'Anforderung Antragsteller'!H6=\"nicht erforderlich\"),\"-\",$C5)","v":"-"},{"$f":"IF(OR('Anforderung Antragsteller'!M6=\"muss nicht erneut eingereicht werden\",'Anforderung Antragsteller'!M6=\"nicht erforderlich\"),\"-\",$C5)","v":"-"},{"$f":"IF(OR('Anforderung Antragsteller'!R6=\"muss nicht erneut eingereicht werden\",'Anforderung Antragsteller'!R6=\"nicht erforderlich\"),\"-\",$C5)","v":"-"},{"$f":"IF(OR('Anforderung Antragsteller'!W6=\"muss nicht erneut eingereicht werden\",'Anforderung Antragsteller'!W6=\"nicht erforderlich\"),\"-\",$C5)","v":"-"},{"$f":"IF(OR('Anforderung Antragsteller'!AB6=\"muss nicht erneut eingereicht werden\",'Anforderung Antragsteller'!AB6=\"nicht erforderlich\"),\"-\",$C5)","v":"-"},{"$f":"IF(OR('Anforderung Antragsteller'!AG6=\"muss nicht erneut eingereicht werden\",'Anforderung Antragsteller'!AG6=\"nicht erforderlich\"),\"-\",$C5)","v":"-"}]
[null,"- Unterschriebener akkreditierter Leistungs-Prüfbericht UND","ja",{"$f":"IF(OR('Anforderung Antragsteller'!H7=\"muss nicht erneut eingereicht werden\",'Anforderung Antragsteller'!H7=\"nicht erforderlich\"),\"-\",$C6)","v":"ja"},{"$f":"IF(OR('Anforderung Antragsteller'!M7=\"muss nicht erneut eingereicht werden\",'Anforderung Antragsteller'!M7=\"nicht erforderlich\"),\"nein\",$C6)","v":"ja"},{"$f":"IF(OR('Anforderung Antragsteller'!R7=\"muss nicht erneut eingereicht werden\",'Anforderung Antragsteller'!R7=\"nicht erforderlich\"),\"-\",$C6)","v":"ja"},"nein",{"$f":"IF(OR('Anforderung Antragsteller'!AB7=\"muss nicht erneut eingereicht werden\",'Anforderung Antragsteller'!AB7=\"nicht erforderlich\"),\"nein\",$C6)","v":"ja"},"Prüfung KAI"]
{"$rows_left_out":43}