{"text_format":"3","workbook":"xlsx","n_sheets":8,"sheets":["Infos","Anforderungsliste","Dropdown Quelle","Prüfer","Anforderung Antragsteller","Prüfer-Hinweis","Prüfung Priorität","ALT 1.Prüfung"],"not_rendered":{"images":2,"defined_names":9},"read":"whole","date_system":"1900"}

{"sheet":"Infos","index":0,"n_rows":18,"n_cols":7,"rows_kept":18,"merged":[[10,1,10,7]]}
{"$rows_empty":8}
[null,"Informationen zur Anforderungsliste:"]
[]
[null,"Die Anforderungsliste dient als Checkliste für EHPA-Gütesiegel Antragsteller und beinhaltet alle Dokumente und Informationen, welche für ein EHPA-Gütesiegel notwendig sind. Die Anforderungsliste ist verpflichtend auszufüllen und im Antrag hochzuladen.\n\nFühren Sie die Schritte 1 bis 3 durch und tragen Sie in jedem Feld dementsprecheds ein.\n\nEine aktuelle Version dieses Dokumentes finden Sie unter:\nwww.waermepumpe-austria.at/dienste/guetesiegel/dokumente-und-links"]
[]
[null,"Änderungshistorie:"]
{"$rows_left_out":6}
{"sheet":"Anforderungsliste","index":1,"n_rows":52,"n_cols":15,"rows_kept":52,"merged":[[0,1,0,5],[2,12,2,14],[3,0,3,1],[3,5,3,6],[4,5,4,6]]}
[null,"Anforderungsliste  für die EHPA-Gütesiegel-Beantragung"]
[null,"1. Antragsform wählen:",null,"*Bitte aus Liste wählen*",null,"3. Felder ausfüllen:"]
[null,"2. Wärmepumpen-Typ wählen:",null,"*Bitte aus Liste wählen*",null,"Grunddaten (verpflichtend)",null,null,"Modelle (verpflichtend)",{"$nulls":3},"Kommentare (optional)"]
[{"$nulls":5},"*Firmenname*",null,null,"*Modell 1*","*Modell 2*","weiter Spalten einfügen für mehr Modelle",null,"*Name*","*Name*","*Name*"]
[null,"Dokument V13.6            Basis: EHPA Regularien Version 2.3 vom 01.04.2026",null,"Anforderung für die gewählte Antragsform",null,"*Serienname*",{"$nulls":6},"*Datum*","*Datum*","*Datum*"]
[1,"Grundlegendes",null,"-",null,"Dokumentenname","Seite",null,"ok … eingereicht\nx … nicht eingereicht / -korrekt\n- … nicht notwendig"]
{"$rows_left_out":47}
{"sheet":"Dropdown Quelle","index":2,"n_rows":7,"n_cols":9,"rows_kept":7,"hidden":true}
[]
[]
[]
[]
["Antragsform wählen:","*Bitte aus Liste wählen*","Erstantrag","Übertragung von anderem Land oder anderem Unternehmen","1. und 2. Verlängerung  (Gültigkeit max. 9 Jahre)","ab 3. Verlängerung (Gültigkeit über 9 Jahre)","Erweiterung von eigenem Gütesiegel","Änderung der Produktbezeichnungen","Technische Änderungen am Produkt"]
[]
{"$rows_left_out":2}
{"sheet":"Prüfer","index":3,"n_rows":52,"n_cols":7,"rows_kept":52,"hidden":true,"merged":[[3,0,3,1],[3,5,3,6],[4,5,4,6]]}
[null,"Anforderungsliste  für die EHPA-Gütesiegel-Beantragung"]
[null,"Antragsform:",null,{"$f":"Antr","v":"*Bitte aus Liste wählen*"}]
[null,"Wärmepumpen-Typ:",null,{"$f":"Anforderungsliste!D3","v":"*Bitte aus Liste wählen*"}]
[{"$nulls":5},{"$f":"Anforderungsliste!F4","v":"*Firmenname*"}]
[{"$nulls":3},"Anforderung für die gewählte Antragsform",null,{"$f":"Anforderungsliste!F5","v":"*Serienname*"}]
[1,"Grundlegendes",{"$nulls":3},"Hinweise zur Prüfung","ist verpflichtend zum Ausstellen"]
{"$rows_left_out":47}
{"sheet":"Anforderung Antragsteller","index":4,"n_rows":51,"n_cols":37,"rows_kept":51,"hidden":true,"merged":[[2,2,2,6],[2,7,2,11],[2,12,2,16],[2,17,2,21],[2,22,2,26],[2,27,2,31],[2,32,2,36],[3,2,3,6],[3,7,3,11],[3,12,3,16],[3,17,3,21],[3,22,3,26],[3,27,3,31],[3,32,3,36]]}
["Liste Anforderungen an den Antragsteller je Antrag"]
[]
[null,null,{"$f":"'Dropdown Quelle'!C5","v":"Erstantrag"},{"$nulls":4},{"$f":"'Dropdown Quelle'!D5","v":"Übertragung von anderem Land oder anderem Unternehmen"},{"$nulls":4},{"$f":"'Dropdown Quelle'!E5","v":"1. und 2. Verlängerung  (Gültigkeit max. 9 Jahre)"},{"$nulls":4},{"$f":"'Dropdown Quelle'!F5","v":"ab 3. Verlängerung (Gültigkeit über 9 Jahre)"},{"$nulls":4},{"$f":"'Dropdown Quelle'!G5","v":"Erweiterung von eigenem Gütesiegel"},{"$nulls":4},{"$f":"'Dropdown Quelle'!H5","v":"Änderung der Produktbezeichnungen"},{"$nulls":4},{"$f":"'Dropdown Quelle'!I5","v":"Technische Änderungen am Produkt"}]
[null,null,"Erstantrag (Elterngütesiegel);  Einzelprodukt oder Baureihe",{"$nulls":4},"Übertragung auf Basis eines Elterngütesiegel (Followup-Gütesiegel);   Übertragung zwischen zwei Ländern oder Unternehmen, mit gleicher oder nicht gleicher Produktbezeichnung",{"$nulls":4},"Verlängerung von Elterngütesiegel oder Followup; 1. und 2. Verlängerung des Elterngütesiegels",{"$nulls":4},"Verlängerung von Elterngütesiegel oder Followup; jede weitere Verlängerung",{"$nulls":4},"Erweiterung von Elterngütesiegel oder Followup;  Erweiterung des Gütesiegels um ein oder mehrere Modelle",{"$nulls":4},"Änderung von Elterngütesiegel oder Followup;  Änderung der Produktbezeichnungen",{"$nulls":4},"Technische Änderungen am Produkt"]
[1,"Grundlegendes",{"$f":"$C$3&\" \"&'Dropdown Quelle'!C7","v":"Erstantrag Luft/Wasser"},{"$f":"$C$3&\" \"&'Dropdown Quelle'!D7","v":"Erstantrag Wasser/Wasser"},{"$f":"$C$3&\" \"&'Dropdown Quelle'!E7","v":"Erstantrag Sole/Wasser"},{"$f":"$C$3&\" \"&'Dropdown Quelle'!F7","v":"Erstantrag Luft/Luft"},{"$f":"$C$3&\" \"&'Dropdown Quelle'!G7","v":"Erstantrag Brauchwasser Wärmepumpe"},{"$f":"$H$3&\" \"&'Dropdown Quelle'!C7","v":"Übertragung von anderem Land oder anderem Unternehmen Luft/Wasser"},{"$f":"$H$3&\" \"&'Dropdown Quelle'!D7","v":"Übertragung von anderem Land oder anderem Unternehmen Wasser/Wasser"},{"$f":"$H$3&\" \"&'Dropdown Quelle'!E7","v":"Übertragung von anderem Land oder anderem Unternehmen Sole/Wasser"},{"$f":"$H$3&\" \"&'Dropdown Quelle'!F7","v":"Übertragung von anderem Land oder anderem Unternehmen Luft/Luft"},{"$f":"$H$3&\" \"&'Dropdown Quelle'!G7","v":"Übertragung von anderem Land oder anderem Unternehmen Brauchwasser Wärmepumpe"},{"$f":"$M$3&\" \"&'Dropdown Quelle'!C7","v":"1. und 2. Verlängerung  (Gültigkeit max. 9 Jahre) Luft/Wasser"},{"$f":"$M$3&\" \"&'Dropdown Quelle'!D7","v":"1. und 2. Verlängerung  (Gültigkeit max. 9 Jahre) Wasser/Wasser"},{"$f":"$M$3&\" \"&'Dropdown Quelle'!E7","v":"1. und 2. Verlängerung  (Gültigkeit max. 9 Jahre) Sole/Wasser"},{"$f":"$M$3&\" \"&'Dropdown Quelle'!F7","v":"1. und 2. Verlängerung  (Gültigkeit max. 9 Jahre) Luft/Luft"},{"$f":"$M$3&\" \"&'Dropdown Quelle'!G7","v":"1. und 2. Verlängerung  (Gültigkeit max. 9 Jahre) Brauchwasser Wärmepumpe"},{"$f":"$R$3&\" \"&'Dropdown Quelle'!C7","v":"ab 3. Verlängerung (Gültigkeit über 9 Jahre) Luft/Wasser"},{"$f":"$R$3&\" \"&'Dropdown Quelle'!D7","v":"ab 3. Verlängerung (Gültigkeit über 9 Jahre) Wasser/Wasser"},{"$f":"$R$3&\" \"&'Dropdown Quelle'!E7","v":"ab 3. Verlängerung (Gültigkeit über 9 Jahre) Sole/Wasser"},{"$f":"$R$3&\" \"&'Dropdown Quelle'!F7","v":"ab 3. Verlängerung (Gültigkeit über 9 Jahre) Luft/Luft"},{"$f":"$R$3&\" \"&'Dropdown Quelle'!G7","v":"ab 3. Verlängerung (Gültigkeit über 9 Jahre) Brauchwasser Wärmepumpe"},{"$f":"$W$3&\" \"&'Dropdown Quelle'!C7","v":"Erweiterung von eigenem Gütesiegel Luft/Wasser"},{"$f":"$W$3&\" \"&'Dropdown Quelle'!D7","v":"Erweiterung von eigenem Gütesiegel Wasser/Wasser"},{"$f":"$W$3&\" \"&'Dropdown Quelle'!E7","v":"Erweiterung von eigenem Gütesiegel Sole/Wasser"},{"$f":"$W$3&\" \"&'Dropdown Quelle'!F7","v":"Erweiterung von eigenem Gütesiegel Luft/Luft"},{"$f":"$W$3&\" \"&'Dropdown Quelle'!G7","v":"Erweiterung von eigenem Gütesiegel Brauchwasser Wärmepumpe"},{"$f":"$AB$3&\" \"&'Dropdown Quelle'!C7","v":"Änderung der Produktbezeichnungen Luft/Wasser"},{"$f":"$AB$3&\" \"&'Dropdown Quelle'!D7","v":"Änderung der Produktbezeichnungen Wasser/Wasser"},{"$f":"$AB$3&\" \"&'Dropdown Quelle'!E7","v":"Änderung der Produktbezeichnungen Sole/Wasser"},{"$f":"$AB$3&\" \"&'Dropdown Quelle'!F7","v":"Änderung der Produktbezeichnungen Luft/Luft"},{"$f":"$AB$3&\" \"&'Dropdown Quelle'!G7","v":"Änderung der Produktbezeichnungen Brauchwasser Wärmepumpe"},{"$f":"$AG$3&\" \"&'Dropdown Quelle'!C7","v":"Technische Änderungen am Produkt Luft/Wasser"},{"$f":"$AG$3&\" \"&'Dropdown Quelle'!D7","v":"Technische Änderungen am Produkt Wasser/Wasser"},{"$f":"$AG$3&\" \"&'Dropdown Quelle'!E7","v":"Technische Änderungen am Produkt Sole/Wasser"},{"$f":"$AG$3&\" \"&'Dropdown Quelle'!F7","v":"Technische Änderungen am Produkt Luft/Luft"},{"$f":"$AG$3&\" \"&'Dropdown Quelle'!G7","v":"Technische Änderungen am Produkt Brauchwasser Wärmepumpe"}]
[null,"akkreditierte Prüfberichte nach EN 12102-1 und -2, EN 14511-2 bis 4 und EN 14825, bzw. EN 16147 bei Trinkwasser\nAnzahl hängt vom Umfang der Modelreihe ab","-","-","-","-","-","-","-","-","-","-","-","-","-","-","-","-","-","-","-","-","-","-","-","-","-","-","-","-","-","-","-","-","-","-","-"]
{"$rows_left_out":46}
{"sheet":"Prüfer-Hinweis","index":5,"n_rows":50,"n_cols":9,"rows_kept":50,"hidden":true}
["2. Prüfung Prüferhinweis"]
[]
[null,null,{"$f":"'Anforderung Antragsteller'!C3","v":"Erstantrag"},{"$f":"'Anforderung Antragsteller'!H3","v":"Übertragung von anderem Land oder anderem Unternehmen"},{"$f":"'Anforderung Antragsteller'!M3","v":"1. und 2. Verlängerung  (Gültigkeit max. 9 Jahre)"},{"$f":"'Anforderung Antragsteller'!R3","v":"ab 3. Verlängerung (Gültigkeit über 9 Jahre)"},{"$f":"'Anforderung Antragsteller'!W3","v":"Erweiterung von eigenem Gütesiegel"},{"$f":"'Anforderung Antragsteller'!AB3","v":"Änderung der Produktbezeichnungen"},{"$f":"'Anforderung Antragsteller'!AG3","v":"Technische Änderungen am Produkt"}]
[1,"Grundlegendes"]
[null,"akkreditierte Prüfberichte nach EN 12102-1 und -2, EN 14511-2 bis 4 und EN 14825, bzw. EN 16147 bei Trinkwasser\nAnzahl hängt vom Umfang der Modelreihe ab","-","-","-","-","-","-","-"]
[null,"- Unterschriebener detaillierter akkreditierter Leistungs-Prüfbericht nach EHPA Regularien oder HP-Keymark Regularien UND","Ist die Prüfung nach EHPA Regularien oder HP-Keymark-Schema und unter der Akkreditierung des Prüfinsitutes durchgeführt worden (Logo eines nationalen oder Internationalen Akkreditierungs-Institiutes oder schriftlicher Verweis auf die Akkreditierung); ist der Prüfbericht unterschrieben oder gültig digital signiert; stimmen Leistungswerte mit den technischen Unterlagen überein (SCOP +- 0,1 lt. Freimüller); wurden die erforderliche Anzahl an Prüfberichten eingereicht; Wird das Gerät als LT und MT verkauft müssen auch im Prüfbericht SCOP Werte für beide Temperaturanwendungen enthalten sein.",{"$f":"IF(OR('Anforderung Antragsteller'!H7=\"muss nicht erneut eingereicht werden\",'Anforderung Antragsteller'!H7=\"nicht erforderlich\"),\"-\",$C6)","v":"Ist die Prüfung nach EHPA Regularien oder HP-Keymark-Schema und unter der Akkreditierung des Prüfinsitutes durchgeführt worden (Logo eines nationalen oder Internationalen Akkreditierungs-Institiutes oder schriftlicher Verweis auf die Akkreditierung); ist der Prüfbericht unterschrieben oder gültig digital signiert; stimmen Leistungswerte mit den technischen Unterlagen überein (SCOP +- 0,1 lt. Freimüller); wurden die erforderliche Anzahl an Prüfberichten eingereicht; Wird das Gerät als LT und MT verkauft müssen auch im Prüfbericht SCOP Werte für beide Temperaturanwendungen enthalten sein."},{"$f":"IF(OR('Anforderung Antragsteller'!M7=\"muss nicht erneut eingereicht werden\",'Anforderung Antragsteller'!M7=\"nicht erforderlich\"),\"-\",$C6)","v":"-"},{"$f":"IF(OR('Anforderung Antragsteller'!R7=\"muss nicht erneut eingereicht werden\",'Anforderung Antragsteller'!R7=\"nicht erforderlich\"),\"-\",$C6)","v":"Ist die Prüfung nach EHPA Regularien oder HP-Keymark-Schema und unter der Akkreditierung des Prüfinsitutes durchgeführt worden (Logo eines nationalen oder Internationalen Akkreditierungs-Institiutes oder schriftlicher Verweis auf die Akkreditierung); ist der Prüfbericht unterschrieben oder gültig digital signiert; stimmen Leistungswerte mit den technischen Unterlagen überein (SCOP +- 0,1 lt. Freimüller); wurden die erforderliche Anzahl an Prüfberichten eingereicht; Wird das Gerät als LT und MT verkauft müssen auch im Prüfbericht SCOP Werte für beide Temperaturanwendungen enthalten sein."},{"$f":"IF(OR('Anforderung Antragsteller'!W7=\"muss nicht erneut eingereicht werden\",'Anforderung Antragsteller'!W7=\"nicht erforderlich\"),\"-\",$C6)","v":"Ist die Prüfung nach EHPA Regularien oder HP-Keymark-Schema und unter der Akkreditierung des Prüfinsitutes durchgeführt worden (Logo eines nationalen oder Internationalen Akkreditierungs-Institiutes oder schriftlicher Verweis auf die Akkreditierung); ist der Prüfbericht unterschrieben oder gültig digital signiert; stimmen Leistungswerte mit den technischen Unterlagen überein (SCOP +- 0,1 lt. Freimüller); wurden die erforderliche Anzahl an Prüfberichten eingereicht; Wird das Gerät als LT und MT verkauft müssen auch im Prüfbericht SCOP Werte für beide Temperaturanwendungen enthalten sein."},{"$f":"IF(OR('Anforderung Antragsteller'!AB7=\"muss nicht erneut eingereicht werden\",'Anforderung Antragsteller'!AB7=\"nicht erforderlich\"),\"-\",$C6)","v":"-"},"Prübreicht ist nur dann notwendig, wenn die Gütesiegel-Kommission eine Nachmessung verlangt"]
{"$rows_left_out":45}
{"sheet":"Prüfung Priorität","index":6,"n_rows":50,"n_cols":9,"rows_kept":50,"hidden":true}
["2. Prüfung Priorität - verpflichtende Anforderung zum Ausstellen"]
[]
[null,null,{"$f":"'Anforderung Antragsteller'!C3","v":"Erstantrag"},{"$f":"'Anforderung Antragsteller'!H3","v":"Übertragung von anderem Land oder anderem Unternehmen"},{"$f":"'Anforderung Antragsteller'!M3","v":"1. und 2. Verlängerung  (Gültigkeit max. 9 Jahre)"},{"$f":"'Anforderung Antragsteller'!R3","v":"ab 3. Verlängerung (Gültigkeit über 9 Jahre)"},{"$f":"'Anforderung Antragsteller'!W3","v":"Erweiterung von eigenem Gütesiegel"},{"$f":"'Anforderung Antragsteller'!AB3","v":"Änderung der Produktbezeichnungen"},{"$f":"'Anforderung Antragsteller'!AG3","v":"Technische Änderungen am Produkt"}]
[1,"Grundlegendes"]
[null,"akkreditierte Prüfberichte nach EN 12102-1 und -2, EN 14511-2 bis 4 und EN 14825, bzw. EN 16147 bei Trinkwasser\nAnzahl hängt vom Umfang der Modelreihe ab","-","-","-","-","-","-","-"]
[null,"- Unterschriebener detaillierter akkreditierter Leistungs-Prüfbericht nach EHPA Regularien oder HP-Keymark Regularien UND","ja, egal welches Prüfschema (HP-Keymark, EHPA, …)",{"$f":"IF(OR('Anforderung Antragsteller'!H7=\"muss nicht erneut eingereicht werden\",'Anforderung Antragsteller'!H7=\"nicht erforderlich\"),\"-\",$C6)","v":"ja, egal welches Prüfschema (HP-Keymark, EHPA, …)"},{"$f":"IF(OR('Anforderung Antragsteller'!M7=\"muss nicht erneut eingereicht werden\",'Anforderung Antragsteller'!M7=\"nicht erforderlich\"),\"-\",$C6)","v":"-"},{"$f":"IF(OR('Anforderung Antragsteller'!R7=\"muss nicht erneut eingereicht werden\",'Anforderung Antragsteller'!R7=\"nicht erforderlich\"),\"-\",$C6)","v":"ja, egal welches Prüfschema (HP-Keymark, EHPA, …)"},{"$f":"IF(OR('Anforderung Antragsteller'!W7=\"muss nicht erneut eingereicht werden\",'Anforderung Antragsteller'!W7=\"nicht erforderlich\"),\"-\",$C6)","v":"ja, egal welches Prüfschema (HP-Keymark, EHPA, …)"},{"$f":"IF(OR('Anforderung Antragsteller'!AB7=\"muss nicht erneut eingereicht werden\",'Anforderung Antragsteller'!AB7=\"nicht erforderlich\"),\"-\",$C6)","v":"-"},{"$f":"IF(OR('Anforderung Antragsteller'!AG7=\"muss nicht erneut eingereicht werden\",'Anforderung Antragsteller'!AG7=\"nicht erforderlich\"),\"-\",$C6)","v":"ja, egal welches Prüfschema (HP-Keymark, EHPA, …)"}]
{"$rows_left_out":45}
{"sheet":"ALT 1.Prüfung","index":7,"n_rows":49,"n_cols":9,"rows_kept":49,"hidden":true}
["Liste für 1.Prüfung"]
[]
[null,null,{"$f":"'Anforderung Antragsteller'!C3","v":"Erstantrag"},{"$f":"'Anforderung Antragsteller'!H3","v":"Übertragung von anderem Land oder anderem Unternehmen"},{"$f":"'Anforderung Antragsteller'!M3","v":"1. und 2. Verlängerung  (Gültigkeit max. 9 Jahre)"},{"$f":"'Anforderung Antragsteller'!R3","v":"ab 3. Verlängerung (Gültigkeit über 9 Jahre)"},{"$f":"'Anforderung Antragsteller'!W3","v":"Erweiterung von eigenem Gütesiegel"},{"$f":"'Anforderung Antragsteller'!AB3","v":"Änderung der Produktbezeichnungen"},{"$f":"'Anforderung Antragsteller'!AG3","v":"Technische Änderungen am Produkt"}]
[1,"Grundlegendes"]
[null,"akkreditierte Prüfberichte nach EN 14511-1 bis 4 und EN 14825, bzw. EN 16147 und EN 12102-1 \nAnzahl hängt vom Umfang der Modelreihe ab","-",{"$f":"IF(OR('Anforderung Antragsteller'!H6=\"muss nicht erneut eingereicht werden\",'Anforderung Antragsteller'!H6=\"nicht erforderlich\"),\"-\",$C5)","v":"-"},{"$f":"IF(OR('Anforderung Antragsteller'!M6=\"muss nicht erneut eingereicht werden\",'Anforderung Antragsteller'!M6=\"nicht erforderlich\"),\"-\",$C5)","v":"-"},{"$f":"IF(OR('Anforderung Antragsteller'!R6=\"muss nicht erneut eingereicht werden\",'Anforderung Antragsteller'!R6=\"nicht erforderlich\"),\"-\",$C5)","v":"-"},{"$f":"IF(OR('Anforderung Antragsteller'!W6=\"muss nicht erneut eingereicht werden\",'Anforderung Antragsteller'!W6=\"nicht erforderlich\"),\"-\",$C5)","v":"-"},{"$f":"IF(OR('Anforderung Antragsteller'!AB6=\"muss nicht erneut eingereicht werden\",'Anforderung Antragsteller'!AB6=\"nicht erforderlich\"),\"-\",$C5)","v":"-"},{"$f":"IF(OR('Anforderung Antragsteller'!AG6=\"muss nicht erneut eingereicht werden\",'Anforderung Antragsteller'!AG6=\"nicht erforderlich\"),\"-\",$C5)","v":"-"}]
[null,"- Unterschriebener akkreditierter Leistungs-Prüfbericht UND","ja",{"$f":"IF(OR('Anforderung Antragsteller'!H7=\"muss nicht erneut eingereicht werden\",'Anforderung Antragsteller'!H7=\"nicht erforderlich\"),\"-\",$C6)","v":"ja"},{"$f":"IF(OR('Anforderung Antragsteller'!M7=\"muss nicht erneut eingereicht werden\",'Anforderung Antragsteller'!M7=\"nicht erforderlich\"),\"nein\",$C6)","v":"nein"},{"$f":"IF(OR('Anforderung Antragsteller'!R7=\"muss nicht erneut eingereicht werden\",'Anforderung Antragsteller'!R7=\"nicht erforderlich\"),\"-\",$C6)","v":"ja"},"nein",{"$f":"IF(OR('Anforderung Antragsteller'!AB7=\"muss nicht erneut eingereicht werden\",'Anforderung Antragsteller'!AB7=\"nicht erforderlich\"),\"nein\",$C6)","v":"nein"},"Prüfung KAI"]
{"$rows_left_out":43}